{"text_format":"1","workbook":"xlsx","n_sheets":2,"sheets":["cheque","Hoja1"],"not_rendered":{"charts":0,"images":0,"macros":1,"external_links":0,"defined_names":0,"comments":0,"pivot_tables":0},"unopened":[],"bounds":{"document_bytes":16777216,"sheet_cells":100000,"rows_first":2000,"rows_last":500,"rows_between":2000,"halvings":0,"cell_chars":16384,"cell_head_chars":4096},"cells_cut":0,"cells_raw":0,"read":"whole","date_system":"1900"}

{"sheet":"cheque","index":0,"n_rows":7,"n_cols":13,"rows_kept":7,"cut":false,"hidden":false,"merged":[[0,0,7,0]]}
[]
[null,null,{"$f":"+VLOOKUP(M2,Hoja1!A2:D281,2,FALSE)","v":"ALCIVAR GOMEZ MARCOS TULIO"},null,null,null,null,null,{"$f":"+VLOOKUP(M2,Hoja1!A2:D281,3,FALSE)","v":743.31102980367086},null,null,"No.",13]
[]
[null,null,{"$f":"+VLOOKUP(M2,Hoja1!A2:D281,4,FALSE)","v":" SETECIENTOS CUARENTA Y TRES 31/100 "}]
[]
[null,null,"**************************************************************************************************"]
[null,null,"QUITO, 15 DE ABRIL DE 2015"]

{"sheet":"Hoja1","index":1,"n_rows":281,"n_cols":5,"rows_kept":281,"cut":false,"hidden":false,"merged":[]}
["No.","Columna1","Monto","mayusculas","minusculas"]
[1,"ABRIL PINARGOTE DARWIN SEGUNDO",920.36516260538838,{"$f":"(+numletras(C2))","v":" NOVECIENTOS VEINTE 37/100 "},{"$f":"LOWER(+numletras(C2))","v":" novecientos veinte 37/100 "}]
[{"$f":"+A2+1","v":2},"ABRIL PINARGOTE YIXON FABRICIO",566.25689700195335,{"$f":"(+numletras(C3))","v":" QUINIENTOS SESENTA Y SEIS 26/100 "},{"$f":"LOWER(+numletras(C3))","v":" quinientos sesenta y seis 26/100 "}]
[{"$f":"+A3+1","v":3},"ABRIL VEGA FREDDY RAMIRO",64.867127366705986," SESENTA Y CUATRO 87/100 "," sesenta y cuatro 87/100 "]
[4,"ACOSTA JARAMILLO ANGELO GIOVANNY",153.39419376756473," CIENTO CINCUENTA Y TRES 39/100 "," ciento cincuenta y tres 39/100 "]
[5,"AGUILAR AGUILAR ANGEL VINICIO",1097.4192954071059," UN MIL NOVENTA Y SIETE 42/100 "," un mil noventa y siete 42/100 "]
[6,"AGUILAR VILLACIS WILLIAM ALFREDO",58.380414630035389," CINCUENTA Y OCHO 38/100 "," cincuenta y ocho 38/100 "]
[7,"AGUIRRE ARROBA DAYBER ERNESTO",743.31102980367086," SETECIENTOS CUARENTA Y TRES 31/100 "," setecientos cuarenta y tres 31/100 "]
[8,"ALAO ALAO AUGUSTO SIMON",91.895097102833475," NOVENTA Y UN 90/100 "," noventa y un 90/100 "]
[9,"ALAVA FARFAN EDISON FERNANDO",920.36516260538838," NOVECIENTOS VEINTE 37/100 "," novecientos veinte 37/100 "]
[10,"ALAVA SALAZAR PATRICIO JAVIER",96.219572260613873," NOVENTA Y SEIS 22/100 "," noventa y seis 22/100 "]
[11,"ALBURQUERQUE AREVALO WILMER AGUSTIN",920.36516260538838," NOVECIENTOS VEINTE 37/100 "," novecientos veinte 37/100 "]
[12,"ALCIVAR ALBAN JUAN FAUSTO",920.36516260538838,{"$f":"(+numletras(C13))","v":" NOVECIENTOS VEINTE 37/100 "}," novecientos veinte 37/100 "]
[13,"ALCIVAR GOMEZ MARCOS TULIO",743.31102980367086,{"$f":"(+numletras(C14))","v":" SETECIENTOS CUARENTA Y TRES 31/100 "}," setecientos cuarenta y tres 31/100 "]
[14,"ALVARADO CEVALLOS OSWALDO WASHINGTON",286.54837157852211,{"$f":"(+numletras(C15))","v":" DOSCIENTOS OCHENTA Y SEIS 55/100 "},{"$f":"LOWER(+numletras(C15))","v":" doscientos ochenta y seis 55/100 "}]
[15,"ALVARADO VILLAVICENCIO FREDDY FERNANDO",371.90320566574144," TRESCIENTOS SETENTA Y UN 90/100 "," trescientos setenta y un 90/100 "]
[16,"ALVEAR GUTIERREZ FRANKLIN ROBERT",467.85229099107244," CUATROCIENTOS SESENTA Y SIETE 85/100 "," cuatrocientos sesenta y siete 85/100 "]
[17,"ANALUIZA ALVARADO ANGEL RAMIRO",389.20276420023589," TRESCIENTOS OCHENTA Y NUEVE 20/100 "," trescientos ochenta y nueve 20/100 "]
[18,"ANDINO CUAMACAS CARLOS EMILIO",389.20276420023589," TRESCIENTOS OCHENTA Y NUEVE 20/100 "," trescientos ochenta y nueve 20/100 "]
[19,"ANILEMA MULLO THOMAS EFRAIN",23.784613367792193," VEINTITRES 78/100 "," veintitres 78/100 "]
[20,"ANILEMA MULLO CESAR JOSE",743.31102980367086," SETECIENTOS CUARENTA Y TRES 31/100 "," setecientos cuarenta y tres 31/100 "]
[21,"AREVALO RODRIGUEZ PEDRO ALEJANDRO",566.25689700195335," QUINIENTOS SESENTA Y SEIS 26/100 "," quinientos sesenta y seis 26/100 "]
[22,"ARIAS CAGUA ALFREDO ORLANDO",389.20276420023589," TRESCIENTOS OCHENTA Y NUEVE 20/100 "," trescientos ochenta y nueve 20/100 "]
[23,"ARMIJOS ROMAN CRISTIAN JAVIER",165.41117478510026," CIENTO SESENTA Y CINCO 41/100 "," ciento sesenta y cinco 41/100 "]
[24,"ARREAGA FRANCO ALEX ARTURO",144.86991778564337," CIENTO CUARENTA Y CUATRO 87/100 "," ciento cuarenta y cuatro 87/100 "]
[25,"ARREAGA GANCHOZO ANDERSON RAMON",389.20276420023589," TRESCIENTOS OCHENTA Y NUEVE 20/100 "," trescientos ochenta y nueve 20/100 "]
[26,"BARRAGAN PAREDES JUAN VICTORIANO",920.36516260538838," NOVECIENTOS VEINTE 37/100 "," novecientos veinte 37/100 "]
[27,"BARRETO HIDALGO OSCAR PATRICIO",105.94964136561978," CIENTO CINCO 95/100 "," ciento cinco 95/100 "]
[28,"BARZALLO SAEZ PEDRO YOVANY",743.31102980367086," SETECIENTOS CUARENTA Y TRES 31/100 "," setecientos cuarenta y tres 31/100 "]
[29,"BAUTISTA CABEZA ERICK PAUL",34.604588150119376," TREINTA Y CUATRO 60/100 "," treinta y cuatro 60/100 "]
[30,"BAUTISTA CABEZA CRISTIAN ADRIAN",705.61329133079778," SETECIENTOS CINCO 61/100 "," setecientos cinco 61/100 "]
[31,"BECERRA VIZUETE WILFRIDO JACINTO",920.36516260538838," NOVECIENTOS VEINTE 37/100 "," novecientos veinte 37/100 "]
[32,"BEDON CEVALLOS CARLOS ENRIQUE",389.20276420023589," TRESCIENTOS OCHENTA Y NUEVE 20/100 "," trescientos ochenta y nueve 20/100 "]
[33,"BELALCAZAR CALPA ALEXIS DAVID",566.25689700195335," QUINIENTOS SESENTA Y SEIS 26/100 "," quinientos sesenta y seis 26/100 "]
[34,"BELAYO CORDOVA EDUARDO AURELIO",131.89649231230217," CIENTO TREINTA Y UN 90/100 "," ciento treinta y un 90/100 "]
[35,"BLANCA SALDANA RICHARD DANNY",743.31102980367086," SETECIENTOS CUARENTA Y TRES 31/100 "," setecientos cuarenta y tres 31/100 "]
[36,"BOLANOS CUASPUD LUIS FERNANDO",371.90320566574144," TRESCIENTOS SETENTA Y UN 90/100 "," trescientos setenta y un 90/100 "]
[37,"BONILLA RODRIGUEZ LUIS ERMENEGILDO",566.25689700195335," QUINIENTOS SESENTA Y SEIS 26/100 "," quinientos sesenta y seis 26/100 "]
[38,"BRAVO VERA JOSE ANTONIO",355.6880817274378," TRESCIENTOS CINCUENTA Y CINCO 69/100 "," trescientos cincuenta y cinco 69/100 "]
[39,"BURGOS MENDOZA FRANCISCO ROLANDO",389.20276420023589," TRESCIENTOS OCHENTA Y NUEVE 20/100 "," trescientos ochenta y nueve 20/100 "]
[40,"BURGOS RUANO JENNY FATIMA",389.20276420023589," TRESCIENTOS OCHENTA Y NUEVE 20/100 "," trescientos ochenta y nueve 20/100 "]
[41,"BURGOS SOZA EDISON HONORATO",920.36516260538838," NOVECIENTOS VEINTE 37/100 "," novecientos veinte 37/100 "]
[42,"BUSTOS REAL WRIODESLEY VINICIO",327.57899320186522," TRESCIENTOS VEINTISIETE 58/100 "," trescientos veintisiete 58/100 "]
[43,"CABEZAS BRITO LUIS MIGUEL",743.31102980367086," SETECIENTOS CUARENTA Y TRES 31/100 "," setecientos cuarenta y tres 31/100 "]
[44,"CABEZAS LLIGUIN ROSA ANGELICA",920.36516260538838," NOVECIENTOS VEINTE 37/100 "," novecientos veinte 37/100 "]
[45,"CABEZAS MUNOZ JULIO WALDEMAR",789.53221530677899," SETECIENTOS OCHENTA Y NUEVE 53/100 "," setecientos ochenta y nueve 53/100 "]
[46,"CABRERA NARVAEZ NAAIR SNEYDER",389.20276420023589," TRESCIENTOS OCHENTA Y NUEVE 20/100 "," trescientos ochenta y nueve 20/100 "]
[47,"CACERES CACERES JOSE LUIS",91.895097102833475," NOVENTA Y UN 90/100 "," noventa y un 90/100 "]
[48,"CADENA PAREDES CESAR RAMIRO",64.867127366705986," SESENTA Y CUATRO 87/100 "," sesenta y cuatro 87/100 "]
[49,"CAICEDO RUANO SANDER PAUL",920.36516260538838," NOVECIENTOS VEINTE 37/100 "," novecientos veinte 37/100 "]
[50,"CAJAMARCA ALAO VICTOR HUMBERTO",91.895097102833475," NOVENTA Y UN 90/100 "," noventa y un 90/100 "]
[51,"CAJAS TOCA JOSE VICENTE",128.65313594396687," CIENTO VEINTIOCHO 65/100 "," ciento veintiocho 65/100 "]
[52,"CAÑAVERAL COLLAHUAZO CESAR AUGUSTO",908.41930564254881," NOVECIENTOS OCHO 42/100 "," novecientos ocho 42/100 "]
[53,"CANO DE LA TORRE",47.569226735584387," CUARENTA Y SIETE 57/100 "," cuarenta y siete 57/100 "]
[54,"CANTUNA PACHACAMA BYRON DAVID",389.20276420023589," TRESCIENTOS OCHENTA Y NUEVE 20/100 "," trescientos ochenta y nueve 20/100 "]
[55,"CARPIO CEPEDA SEGUNDO ANTONIO",566.25689700195335," QUINIENTOS SESENTA Y SEIS 26/100 "," quinientos sesenta y seis 26/100 "]
[56,"CARRILLO TORRES SEGUNDO RODRIGO",743.31102980367086," SETECIENTOS CUARENTA Y TRES 31/100 "," setecientos cuarenta y tres 31/100 "]
[57,"CASTELO BORJA JORGE ESTUARDO",566.25689700195335," QUINIENTOS SESENTA Y SEIS 26/100 "," quinientos sesenta y seis 26/100 "]
[58,"CASTILLO CASTILLO FRANCISCO LEONARDO",566.25689700195335," QUINIENTOS SESENTA Y SEIS 26/100 "," quinientos sesenta y seis 26/100 "]
[59,"CASTRO BOSADA JUAN EDUARDO",566.25689700195335," QUINIENTOS SESENTA Y SEIS 26/100 "," quinientos sesenta y seis 26/100 "]
[60,"CASTRO CASTRO ROBERTO RODOLFO",743.31102980367086," SETECIENTOS CUARENTA Y TRES 31/100 "," setecientos cuarenta y tres 31/100 "]
[61,"CASTRO PAREJA BRYAN ANTONIO",389.20276420023589," TRESCIENTOS OCHENTA Y NUEVE 20/100 "," trescientos ochenta y nueve 20/100 "]
[62,"CASTRO VILLALVA CARLOS LEONARDO",743.31102980367086," SETECIENTOS CUARENTA Y TRES 31/100 "," setecientos cuarenta y tres 31/100 "]
[63,"CASTRO VILLALVA WILSON EMILIANO",1274.4734282088234," UN MIL DOSCIENTOS SETENTA Y CUATRO 47/100 "," un mil doscientos setenta y cuatro 47/100 "]
[64,"CEDENO RIOS JANNER ANTONIO",151.35663052231396," CIENTO CINCUENTA Y UN 36/100 "," ciento cincuenta y un 36/100 "]
[65,"CEDENO TABARES JOSE EDISON",1097.4192954071059," UN MIL NOVENTA Y SIETE 42/100 "," un mil noventa y siete 42/100 "]
[66,"CEVALLOS REYES FRANKLIN ANDRES",101.62516620783937," CIENTO UN 63/100 "," ciento un 63/100 "]
[{"$f":"+A67+1","v":67},"CHAFLA SANCHEZ HOLGUER JOEL",270.27969736127494," DOSCIENTOS SETENTA 28/100 "," doscientos setenta 28/100 "]
[68,"CHANGO GUEVARA FABIAN MARTIN",96.219572260613873," NOVENTA Y SEIS 22/100 "," noventa y seis 22/100 "]
[69,"CHAVEZ CASTILLO ANGEL ROSENDO",566.25689700195335," QUINIENTOS SESENTA Y SEIS 26/100 "," quinientos sesenta y seis 26/100 "]
[70,"CHIMBA MILLINGALLI FRANKLIN ABEL",57.29929584059029," CINCUENTA Y SIETE 30/100 "," cincuenta y siete 30/100 "]
[71,"CHOEZ BAQUE VICTOR ANDRES",101.62516620783937," CIENTO UN 63/100 "," ciento un 63/100 "]
[72,"CHOEZ PENAFIEL JOSE IVAN",640.16125565414518," SEISCIENTOS CUARENTA 16/100 "," seiscientos cuarenta 16/100 "]
[73,"COIME COLOBON WALTER EDUARDO",389.20276420023589," TRESCIENTOS OCHENTA Y NUEVE 20/100 "," trescientos ochenta y nueve 20/100 "]
[74,"COLLAGUAZO PALLO HECTOR GIOVANNY",389.20276420023589," TRESCIENTOS OCHENTA Y NUEVE 20/100 "," trescientos ochenta y nueve 20/100 "]
[75,"CONDE QUIMBIAMBA FERNANDO RENE",57.29929584059029," CINCUENTA Y SIETE 30/100 "," cincuenta y siete 30/100 "]
[76,"CONDO BUESTAN VICTOR FABIAN",91.895097102833475," NOVENTA Y UN 90/100 "," noventa y un 90/100 "]
[77,"CONFORME VARGAS WILSON WILMER",96.219572260613873," NOVENTA Y SEIS 22/100 "," noventa y seis 22/100 "]
[78,"CORDOVA JIMENEZ JUAN CARLOS",298.74191930526774,{"$f":"(+numletras(C79))","v":" DOSCIENTOS NOVENTA Y OCHO 74/100 "},{"$f":"LOWER(+numletras(C79))","v":" doscientos noventa y ocho 74/100 "}]
[79,"CORELLA VITERI JESUS ERIBERTO",59.461533419480489," CINCUENTA Y NUEVE 46/100 "," cincuenta y nueve 46/100 "]
[80,"CUENCA LUPU OSCAR IVAN",615.29635244859423," SEISCIENTOS QUINCE 30/100 "," seiscientos quince 30/100 "]
[81,"CRIOLLO ARTEAGA JOSE ALFREDO",1097.4192954071059," UN MIL NOVENTA Y SIETE 42/100 "," un mil noventa y siete 42/100 "]
[82,"CRIOLLO ARTEAGA MARCO ANTONIO",164.33005599565516," CIENTO SESENTA Y CUATRO 33/100 "," ciento sesenta y cuatro 33/100 "]
[83,"CUASAPAZ SERRANO LIBARDO ALONSO",389.20276420023589," TRESCIENTOS OCHENTA Y NUEVE 20/100 "," trescientos ochenta y nueve 20/100 "]
[84,"CUEVA CASTILLO JORGE DARIO",389.20276420023589," TRESCIENTOS OCHENTA Y NUEVE 20/100 "," trescientos ochenta y nueve 20/100 "]
[85,"DELGADO GUADAMUD IVAN MARCELO",520.64175807679601," QUINIENTOS VEINTE 64/100 "," quinientos veinte 64/100 "]
[86,"DELGADO SUAREZ DAVID FERNANDO",51.893701893364792," CINCUENTA Y UN 89/100 "," cincuenta y un 89/100 "]
[87,"DELGADO SUAREZ WASHINGTON ENRIQUE",920.36516260538838," NOVECIENTOS VEINTE 37/100 "," novecientos veinte 37/100 "]
[88,"DIAS LARA JHONNY STALIN",389.20276420023589," TRESCIENTOS OCHENTA Y NUEVE 20/100 "," trescientos ochenta y nueve 20/100 "]
[89,"DIAZ VANEGAS ISAAC ARNALDO",91.895097102833475," NOVENTA Y UN 90/100 "," noventa y un 90/100 "]
[90,"DIAZ VELASQUEZ LUIS HIPOLITO",91.895097102833475," NOVENTA Y UN 90/100 "," noventa y un 90/100 "]
[91,"DUCHE DUCHE DUVAL ARIOSTO",389.20276420023589," TRESCIENTOS OCHENTA Y NUEVE 20/100 "," trescientos ochenta y nueve 20/100 "]
[92,"DUQUE CALDERON ENRIQUE MARCELO",200.00697604734344," DOSCIENTOS 01/100 "," doscientos 01/100 "]
[93,"EGAS JARA CARLOS FABRICIO",368.661507200779," TRESCIENTOS SESENTA Y OCHO 66/100 "," trescientos sesenta y ocho 66/100 "]
[94,"ERAZO MORALES EDWIN FERNANDO",1097.4192954071059," UN MIL NOVENTA Y SIETE 42/100 "," un mil noventa y siete 42/100 "]
[95,"ESPINEL LEON CRISTIAN EDUARDO",101.62516620783937," CIENTO UN 63/100 "," ciento un 63/100 "]
[96,"FLORES YANEZ ANA PATRICIA",353.52584414854761," TRESCIENTOS CINCUENTA Y TRES 53/100 "," trescientos cincuenta y tres 53/100 "]
[97,"ESPINOZA ANDRADE ROBERTO PABLO",0," 00/100 "," 00/100 "]
[98,"ESPINOZA NOGUERA NELSON DAVID",743.31102980367086," SETECIENTOS CUARENTA Y TRES 31/100 "," setecientos cuarenta y tres 31/100 "]
[99,"ESTACIO CHILA JOSE ABRAHAM",82.165027997827579," OCHENTA Y DOS 16/100 "," ochenta y dos 16/100 "]
[100,"FLORES CACERES FABRICIO ALEXANDER",389.20276420023589," TRESCIENTOS OCHENTA Y NUEVE 20/100 "," trescientos ochenta y nueve 20/100 "]
[101,"FLORES DUQUE VICTOR ANDRES",382.71605146356529," TRESCIENTOS OCHENTA Y DOS 72/100 "," trescientos ochenta y dos 72/100 "]
[102,"FLORES HALLO EDISON HERNAN",123.88517163394516," CIENTO VEINTITRES 89/100 "," ciento veintitres 89/100 "]
[103,"FRANCO TIGUA GEOVANNY ALBERTO",147.85596755051006," CIENTO CUARENTA Y SIETE 86/100 "," ciento cuarenta y siete 86/100 "]
[104,"FREIRE ANCHUNDIA JOSE ANTONIO",365.4181508324437," TRESCIENTOS SESENTA Y CINCO 42/100 "," trescientos sesenta y cinco 42/100 "]
[105,"FREIRE ANCHUNDIA OSCAR FABIAN",368.661507200779," TRESCIENTOS SESENTA Y OCHO 66/100 "," trescientos sesenta y ocho 66/100 "]
[106,"FUENTES MANOBANDA SEGUNDO GUALBERTO",743.31102980367086," SETECIENTOS CUARENTA Y TRES 31/100 "," setecientos cuarenta y tres 31/100 "]
[107,"GAROFALO GAROFALO JONATHAN LEODAN",149.19439294342376," CIENTO CUARENTA Y NUEVE 19/100 "," ciento cuarenta y nueve 19/100 "]
[108,"GAROFALO GAROFALO MILTON STALIN",0," 00/100 "," 00/100 "]
[109,"GAVILANES RAMIREZ OSCAR MESIAS",389.20276420023589," TRESCIENTOS OCHENTA Y NUEVE 20/100 "," trescientos ochenta y nueve 20/100 "]
[110,"GOMEZ QUISHPI ANGEL VINICIO",149.19439294342376," CIENTO CUARENTA Y NUEVE 19/100 "," ciento cuarenta y nueve 19/100 "]
[111,"GONZABAY LINDAO MANUEL FELICIANO",741.24627694310516," SETECIENTOS CUARENTA Y UN 25/100 "," setecientos cuarenta y un 25/100 "]
[112,"GONZALEZ ALQUINGA HUGO LEONARDO",389.20276420023589," TRESCIENTOS OCHENTA Y NUEVE 20/100 "," trescientos ochenta y nueve 20/100 "]
[113,"GONZALEZ JACOME CRISTIAN IVAN",1097.4192954071059," UN MIL NOVENTA Y SIETE 42/100 "," un mil noventa y siete 42/100 "]
[114,"GUAMAN TIÑE PABLO RIGOBERTO",194.08676889318073," CIENTO NOVENTA Y CUATRO 09/100 "," ciento noventa y cuatro 09/100 "]
[115,"GUAMARICA GARCIA ANGEL ANTONIO",298.74191930526774," DOSCIENTOS NOVENTA Y OCHO 74/100 "," doscientos noventa y ocho 74/100 "]
[116,"GUANO INTE DIEGO MAURICIO",23.784613367792193," VEINTITRES 78/100 "," veintitres 78/100 "]
[117,"GUANOQUIZA ENRIQUEZ CLAUDIO ",91.895097102833475," NOVENTA Y UN 90/100 "," noventa y un 90/100 "]
[118,"HEREDIA ERAZO POLI ANTONIO",389.20276420023589," TRESCIENTOS OCHENTA Y NUEVE 20/100 "," trescientos ochenta y nueve 20/100 "]
[119,"HERNANDEZ CORDOVA LUIS OSWALDO",389.20276420023589," TRESCIENTOS OCHENTA Y NUEVE 20/100 "," trescientos ochenta y nueve 20/100 "]
{"$rows_left_out":161}